{"text_format":"1","workbook":"xlsx","n_sheets":7,"sheets":["Volume-Based Calculator","Layout-Based Calculator","LB Calcs","Draft","Tables","Pics","Versions"],"not_rendered":{"charts":0,"images":21,"macros":1,"external_links":1,"defined_names":41,"comments":3,"pivot_tables":0},"unopened":[],"bounds":{"document_bytes":16777216,"sheet_cells":100000,"rows_first":2000,"rows_last":500,"rows_between":2000,"halvings":0,"cell_chars":16384,"cell_head_chars":4096},"cells_cut":0,"cells_raw":0,"read":"whole","date_system":"1900"}

{"sheet":"Volume-Based Calculator","index":0,"n_rows":270,"n_cols":44,"rows_kept":270,"cut":false,"hidden":false,"merged":[[5,1,5,31],[11,1,11,31],[19,1,19,31],[45,1,45,31],[48,20,48,21],[48,12,48,13],[13,19,13,20],[9,23,9,25],[7,24,7,25],[7,17,7,19],[7,21,7,22],[9,18,9,22],[7,26,7,30],[9,26,9,30],[54,3,54,4],[54,6,54,7],[54,12,54,13],[7,2,7,3],[9,2,9,3],[9,8,9,9],[9,10,9,14],[43,6,43,14],[7,4,7,7],[9,4,9,7],[7,13,7,14]]}
[]
[]
[]
[null,null,null,null,null,null,null,null,"Standard Units Calculator"]
[]
[null,"PROJECT DESCRIPTION"]
[]
[null,null,"Project Name:",null,null,null,null,null,"Date:",null,"/",null,"/",null,null,null,"City/State:",null,null,null,"/",null,null,null,"Phone #:"]
[]
[null,null,"Engineer:",null,null,null,null,null,"Contractor:",null,null,null,null,null,null,null,"Designed By:",null,null,null,null,null,null,"Prinsco Rep:"]
[]
[null,"DESIGN CRITERIA - BASED ON STORAGE VOLUME"]
[null,null,null,null,null,null,null,null,null,null,null,null,null,null,null,null,null,null,null,null,null,null,null,null,null,null,"**For Metric units, visit Prinsco.com"]
[null,null,null,null,null,null,null,null,null,null,null,null,null,null,null,null,null,null,null,null,null,null,{"$f":"IF($AH$14=\"Standard\",\"(in)\",\"(mm)\")","v":"(in)"},null,null,null,null,null,null,"**",null,null,null,"Standard"]
[]
[null,null,null,null,null,10000,{"$f":"IF($AH$14=\"Standard\",\"(cf)\",CONCATENATE(\"(m\",$AJ$16,\")\"))","v":"(cf)"},null,null,null,null,38,{"$f":"IF($AH$14=\"Standard\",\"(ft)\",\"(m)\")","v":"(ft)"},null,null,null,40,"%",null,null,null,null,0,{"$f":"IF($AH$14=\"Standard\",\"(ft)\",\"(m)\")","v":"(ft)"},null,null,4.5,{"$f":"IF($AH$14=\"Standard\",\"(ft)\",\"(m)\")","v":"(ft)"},null,3.5,{"$f":"IF($AH$14=\"Standard\",\"(ft)\",\"(m)\")","v":"(ft)"},null,null,null,"²","³"]
[]
[null,null,null,null,null,0,{"$f":"IF($AH$14=\"Standard\",\"(in)\",\"(mm)\")","v":"(in)"},null,null,null,null,0,{"$f":"IF($AH$14=\"Standard\",\"(in)\",\"(mm)\")","v":"(in)"},null,null,null,0,{"$f":"IF($AH$14=\"Standard\",\"(in)\",\"(mm)\")","v":"(in)"},null,null,null,null,0,{"$f":"IF($AH$14=\"Standard\",\"(in)\",\"(mm)\")","v":"(in)"}]
[]
[null,"SYSTEM LAYOUT"]
[]
[]
[]
[]
[]
[]
[]
[null,null,null,null,null,null,null,null,null,null,null,null,null,null,null,null,null,null,null,null,null,null,null,null,null,null,null,null,null,null,null,null,null,1]
[null,null,null,null,null,null,null,null,null,null,null,null,null,null,null,null,null,null,null,null,null,null,null,null,null,null,null,null,null,null,null,null,null,0]
[null,null,null,null,null,null,null,null,null,null,null,null,null,null,null,null,null,null,null,null,null,null,null,null,null,null,null,null,null,null,null,null,null,0]
{"$rows_left_out":241}
{"sheet":"Layout-Based Calculator","index":1,"n_rows":46,"n_cols":56,"rows_kept":46,"cut":false,"hidden":false,"merged":[[42,47,42,48],[42,49,42,51],[38,12,38,13],[38,19,38,20],[38,27,38,28],[38,35,38,36],[38,42,38,44],[42,8,42,9],[42,15,42,16],[42,23,42,24],[42,31,42,32],[42,39,42,40],[31,25,33,28],[8,5,8,55],[11,40,11,54],[12,28,12,29],[12,37,12,38],[12,44,12,45],[12,52,12,53],[14,10,14,11],[14,19,14,20],[14,28,14,29],[14,37,14,38],[30,11,30,12],[31,11,31,12],[6,46,6,54],[6,10,6,18],[3,5,3,55],[5,10,5,18],[5,22,5,23],[5,28,5,29],[5,25,5,26],[6,23,6,29],[5,41,5,42],[5,34,5,39],[6,34,6,42],[5,46,5,54]]}
[]
[]
[null,null,null,null,null,null,null,null,null,null,null,null,null,null,null,"Standard Units Calculator"]
[null,null,null,null,null,"PROJECT DESCRIPTION"]
[]
[null,null,null,null,null,null,null,null,null,"Project Name:",null,null,null,null,null,null,null,null,null,null,null,"Date:",null,null,"/",null,null,"/",null,null,null,null,null,"City / State:",null,null,null,null,null,null,"/",null,null,null,null,"Phone #:"]
[null,null,null,null,null,null,null,null,null,"Engineer:",null,null,null,null,null,null,null,null,null,null,null,null,"Contractor:",null,null,null,null,null,null,null,null,null,null,"Designed By:",null,null,null,null,null,null,null,null,null,null,null,"Prinsco Rep:"]
[]
[null,null,null,null,null,"DESIGN CRITERIA - BASED ON SYSTEM DIMENSIONS"]
[]
[]
[null,null,null,null,null,null,null,null,null,null,null,null,null,null,null,null,null,null,null,null,null,null,null,null,null,null,null,null,null,null,null,null,null,null,null,null,null,null,null,null,"One Value Must Be Zero"]
[null,null,null,null,null,null,null,null,null,null,5,null,null,null,null,null,null,null,null,5,null,null,null,null,null,null,null,null,40,null,"%",null,null,null,null,null,null,0,null,{"$f":"IF(Draft!$S$3=2,\"(ft)\",\"(m)\")","v":"(ft)"},null,null,null,null,12.5,null,{"$f":"IF(Draft!$S$3=2,\"(ft)\",\"(m)\")","v":"(ft)"},null,null,null,null,null,6.54,null,{"$f":"IF(Draft!$S$3=2,\"(ft)\",\"(m)\")","v":"(ft)"}]
[]
[null,null,null,null,null,null,null,null,null,null,0,null,{"$f":"IF(Draft!$S$3=2,\"(in)\",\"(mm)\")","v":"(in)"},null,null,null,null,null,null,0,null,{"$f":"IF(Draft!$S$3=2,\"(in)\",\"(mm)\")","v":"(in)"},null,null,null,null,null,null,0,null,{"$f":"IF(Draft!$S$3=2,\"(in)\",\"(mm)\")","v":"(in)"},null,null,null,null,null,null,0,null,{"$f":"IF(Draft!$S$3=2,\"(in)\",\"(mm)\")","v":"(in)"},null,null,null,null,null,null,null,null,null,null,null,null,null,"**"]
[null,null,null,null,null,null,null,null,null,null,null,null,null,null,null,null,null,null,null,null,null,null,null,null,null,null,null,null,null,null,null,null,null,null,null,null,null,null,null,null,null,null,"**For Metric units, visit Prinsco.com"]
[]
[]
[]
[]
[]
[]
[]
[]
[]
[]
[]
[]
[]
[]
{"$rows_left_out":17}
{"sheet":"LB Calcs","index":2,"n_rows":65,"n_cols":17,"rows_kept":65,"cut":false,"hidden":true,"merged":[]}
[null,null,null,null,null,null,null,null,"Conversion Column","Final LB Outputs","Chamber Size","Constraint Type","Pipe Diameters (IN)","# of Manifolds","Include Volume of the Manifolds","Conversions Key "]
[null,null,null,null,null,null,null,null,null,null,"HS290","LENGTH",{"$f":"IF(A4=4,\"8 in (200 mm)\",\"\")","v":"8 in (200 mm)"},1,"Yes","in/m",39.370100000000001]
[null,"Inputs","Inputs","inch values",null,"Outputs",null,null,null,null,"HS180","WIDTH",{"$f":"IF(A4=4,\"10 in (250 mm)\",\"\")","v":"10 in (250 mm)"},2,"No","ft/m",3.28]
[4,"Chamber Size",{"$f":"IF(A4=3,\"HS75\",IF(A4=2,\"HS180\",IF(A4=1,\"HS290\",\"HS31\")))","v":"HS31"},null,null,"Chamber Storage",{"$f":"IF(C4=\"HS75\",((G33*Tables!Q16)+(G32*Tables!O16)),IF(C4=\"HS180\",((G33*Tables!Q17)+(G32*Tables!O17)),IF(C4=\"HS31\",((G33*Tables!Q15)+(G32*Tables!O15)),((G33*Tables!Q18)+(G32*Tables!O18)))))","v":385.2},"cf",{"$f":"G4/Q4","v":10.907639028506543},null,"HS75",null,"12 in. (300 mm)",null,null,"cf/cm",35.314700000000002]
[3,"Manifold size",{"$f":"IF(A5=1,8,IF(A5=2,10,IF(A5=3,12,IF(A5=4,15,IF(A5=5,18,IF(A5=6,24,IF(A5=7,30,IF(A5=8,36))))))))","v":12},null,null,"Manifold Storage",{"$f":"IF(C7=\"YES\",(((VLOOKUP(C5,Tables!C3:Q11,13,0))+((C8-1)*VLOOKUP(C5,Tables!C3:Q11,10,0))+((G19-(VLOOKUP(C5,Tables!C3:Q11,12,0)/12)-((C8-1)*(VLOOKUP(C5,Tables!C3:Q11,9,0)/12)))*VLOOKUP(C5,Tables!C3:Q11,8,0)))*C6),0)","v":13.256669757634928},"cf",{"$f":"G5/Q4","v":0.37538673010488344},null,"HS31",null,{"$f":"IF(A4=4,\"\",\"15 in. (375 mm)\")","v":""},null,null,"cy/cm",1.30795062]
[1,"Number of Manifolds",{"$f":"INDEX(N2:N3,A6)","v":1},null,null,"Manifold Displacement ",{"$f":"((((C8-1)*VLOOKUP(C5,Tables!C3:Q11,11,0))+((G19+(VLOOKUP(C5,Tables!C3:Q11,12,0)/12)-((C8-1)*(VLOOKUP(C5,Tables!C3:Q11,9,0)/12)))*VLOOKUP(C5,Tables!C3:Q11,15,0)))*C6)","v":20.5766730607236},"cf",{"$f":"G6/Q4","v":0.58266594536336425},null,null,null,{"$f":"IF(A4=4,\"\",\"18 in. (450 mm)\")","v":""},null,null,"sy/sm",1.1959900000000001]
[1,"Include Manifold Volume",{"$f":"IF(A7=1,\"YES\",\"NO\")","v":"YES"},null,null,"Stone Storage",{"$f":"((G9*G35)-G6-G4)*C10","v":493.06202244237721},"cf",{"$f":"G7/Q4","v":13.961948492904575},null,null,null,{"$f":"IF(A4=4,\"\",\"24 in. (600 mm)\")","v":""},null,null,"sf/sm",10.7639]
[null,"Number oF Rows",{"$f":"'Layout-Based Calculator'!K13","v":5},null,null,"Total Storage",{"$f":"G4+G5+G7","v":891.51869220001208},"cf",{"$f":"G8/Q4","v":25.244974251515998},null,null,null,null,null,null,"in/mm",3.9370000000000002E-2]
[null,"Number of Chambers Per Row",{"$f":"'Layout-Based Calculator'!T13","v":5},null,null,"System Footprint",{"$f":"G21*G20","v":703.1895833333333},"sf",{"$f":"G9/Q7","v":65.328513209276693},null,null,null,{"$f":"IF(A4=4,\"\",IF(A4=1,\"\",IF(A4=2,\"\",\"36 in. (900 mm)\")))","v":""}]
[{"$f":"'Layout-Based Calculator'!AC13","v":40},"Stone Porosity",{"$f":"A10/100","v":0.4},null,null,"Required Backfill (Embedment)",{"$f":"((G9*G35)-G6-G4)/27","v":45.653890966886777},"CY",{"$f":"G10/Q5","v":34.904904106308521},null,null,null,null,null,null,"Conversion labels"]
[null,"Additional Stone Below Chamber",{"$f":"'Layout-Based Calculator'!T15","v":0},{"$f":"IF(Draft!$S$3=2,'LB Calcs'!C11*1,'LB Calcs'!C11/$Q$2)","v":0},null,"Non-Woven Geotextile (System Perimeter)",{"$f":"(((G9*2)+(G20*G35*2)+(G21*G35*2))*1.2)/9","v":223.63481111111111},"SY",{"$f":"G11/Q6","v":186.98719145737931},null,null,null,null,null,null,"in",{"$f":"IF(Draft!$S$3=2,'LB Calcs'!P12,'LB Calcs'!P13)","v":"ft"}]
[null,"Additional Stone Above Chamber ",{"$f":"'Layout-Based Calculator'!K15","v":0},{"$f":"IF(Draft!$S$3=2,'LB Calcs'!C12*1,'LB Calcs'!C12*$Q$8)","v":0},null,"Chamber Length",{"$f":"IF(C4=\"HS180\",Tables!F17/12,IF(C4=\"HS75\",Tables!F16/12,IF(C4=\"HS31\",Tables!F15/12,Tables!F18/12)))","v":7.1224999999999996},null,{"$f":"IF(Draft!$S$3=2,'LB Calcs'!G13,G13/$Q$3)","v":36.758333333333333},{"$f":"ROUND(I12,1)&\" \"&$Q$11","v":"36.8 ft"},null,null,null,null,null,"ft",{"$f":"IF(Draft!$S$3=2,'LB Calcs'!P11,'LB Calcs'!P14)","v":"in"}]
[null,"Additional Stone Side of Chamber",{"$f":"'Layout-Based Calculator'!AC15","v":0},{"$f":"IF(Draft!$S$3=2,'LB Calcs'!C13*1,'LB Calcs'!C13*$Q$8)","v":0},null,"System Length (w/o Manifolds)",{"$f":"((C9*G12)+(2*IF(C4=\"HS75\",Tables!P16,IF(C4=\"HS180\",Tables!P17,IF(C4=\"HS31\",Tables!P15,Tables!P18))))/12)","v":36.758333333333333},"ft",null,null,null,null,null,null,null,"m"]
[null,"Additional Spacing Between Chamber",{"$f":"'Layout-Based Calculator'!AL15","v":0},{"$f":"IF(Draft!$S$3=2,'LB Calcs'!C14*1,'LB Calcs'!C14*$Q$8)","v":0},null,"Endcap Stub Lenth (1 side)",{"$f":"(IF(C4=\"HS290\",VLOOKUP(C5,Tables!C3:W11,21,TRUE),IF(C4=\"HS180\",(VLOOKUP(C5,Tables!C3:W11,20,TRUE)),IF(C4=\"HS75\",(VLOOKUP(C5,Tables!C3:W11,19,TRUE)),(VLOOKUP(C5,Tables!C3:W11,18,FALSE)))))/12)","v":0.6216666666666667},"ft",{"$f":"IF(C6>0,G18+(C6*1),G13+(IF(OR(C4=\"HS75\",\"HS180\"),1,2)))","v":39.962500000000006},null,null,null,null,null,null,"mm"]
[null,"Remove Number of Chambers",{"$f":"A15","v":0},null,null,"Manifold Tee/Elbow Overall Length (1 side)",{"$f":"(VLOOKUP(C5,Tables!C3:W11,14,FALSE)/12)","v":1.5824999999999998},"ft"]
[2,"High Rim Elevation",{"$f":"IF(Draft!$S$3=2,'LB Calcs'!D16,'LB Calcs'!D16*'LB Calcs'!$L$18)","v":12.5},{"$f":"'Layout-Based Calculator'!AS13","v":12.5},null,null,null,"ft"]
[{"$f":"'Layout-Based Calculator'!BA13","v":6.54},"Low Rim Elevation",{"$f":"IF(Draft!$S$3=2,'LB Calcs'!D17,'LB Calcs'!D17*'LB Calcs'!$L$18)","v":6.54},{"$f":"'Layout-Based Calculator'!BA13","v":6.54},null,null,null,"ft"]
[{"$f":"'Layout-Based Calculator'!AL13","v":0},"Bottom of Stone (Bottom of System)",{"$f":"IF(Draft!$S$3=2,'LB Calcs'!D18,'LB Calcs'!D18*'LB Calcs'!$L$18)","v":0},{"$f":"'Layout-Based Calculator'!AL13","v":0},null,"System Length (w/ Manifolds)",{"$f":"G13+G14*C6+G15*C6","v":38.962500000000006},"ft"]
[null,null,null,null,null,"System Width",{"$f":"((C8*G23)+((C8-1)*G22))/12","v":15.166666666666666},"ft",{"$f":"IF(Draft!$S$3=2,'LB Calcs'!G19,G19/$Q$3)","v":15.166666666666666},{"$f":"ROUND(I19,1)&\" \"&$Q$11","v":"15.2 ft"}]
[null,null,null,null,null,"Trench Length",{"$f":"G18+IF(C6=0,(G25/12)*2,IF(C6=1,(G25/12)+1,2))","v":40.962500000000006},"ft",{"$f":"IF(Draft!$S$3=2,'LB Calcs'!G20,G20/$Q$3)","v":40.962500000000006},{"$f":"ROUND(I20,1)&\" \"&$Q$11","v":"41 ft"}]
[null,null,null,null,null,"Trench Width",{"$f":"(G19+(2*(G24/12)))+(2*(A13/12))+((C8-1)*(A14/12))","v":17.166666666666664},"ft",{"$f":"IF(Draft!$S$3=2,'LB Calcs'!G21,G21/$Q$3)","v":17.166666666666664},{"$f":"ROUND(I21,1)&\" \"&$Q$11","v":"17.2 ft"}]
[null,null,null,null,null,"Spacing Between Chambers",{"$f":"(IF(C4=\"HS75\",Tables!H16,IF(C4=\"HS180\",Tables!H17,IF(C4=\"HS31\",Tables!H15,Tables!H18))))+$D$14","v":3},"in",{"$f":"IF(Draft!$S$3=2,'LB Calcs'!G22,G22/$Q$8)","v":3},{"$f":"ROUND(I22,1)&\" \"&$Q$12","v":"3 in"}]
[null,null,null,null,null,"Chamber Width",{"$f":"IF(C4=\"HS75\",Tables!E16,IF(C4=\"HS180\",Tables!E17,IF(C4=\"HS31\",Tables!E15,Tables!E18)))","v":34},"in",{"$f":"IF(Draft!$S$3=2,'LB Calcs'!G23,G23/$Q$8)","v":34},{"$f":"ROUND(I23,1)&\" \"&$Q$12","v":"34 in"}]
[null,null,null,null,null,"End Stone (Chamber)",{"$f":"(IF(C4=\"HS75\",Tables!I16,IF(C4=\"HS180\",Tables!I17,IF(C4=\"HS31\",Tables!I15,Tables!I18))))+$D$13","v":12},"in",{"$f":"IF(Draft!$S$3=2,'LB Calcs'!G24,G24/$Q$8)","v":12},{"$f":"ROUND(I24,0)&\" \"&$Q$12","v":"12 in"}]
[null,null,null,null,null,"End Stone (End Cap)",{"$f":"IF(C4=\"HS75\",Tables!J16,IF(C4=\"HS180\",Tables!J17,IF(C4=\"HS31\",Tables!J15,Tables!J18)))","v":12},"in",{"$f":"IF(Draft!$S$3=2,'LB Calcs'!G25,G25/$Q$8)","v":12}]
[null,null,null,null,null,"Bedding Height",{"$f":"(IF(C4=\"HS75\",VLOOKUP(\"HS75\",Tables!C15:R18,9,FALSE),IF(C4=\"HS180\",VLOOKUP(\"HS180\",Tables!C15:R18,9,FALSE),IF(C4=\"HS31\",VLOOKUP(\"HS31\",Tables!C15:R18,9,FALSE),VLOOKUP(\"HS290\",Tables!C15:R18,9,FALSE)))))+$D$11","v":6},"ft",{"$f":"IF(Draft!$S$3=2,'LB Calcs'!G26,G26/$Q$8)","v":6},{"$f":"ROUND(I26,0)&\" \"&$Q$12","v":"6 in"}]
[null,null,null,null,null,"Chamber Height",{"$f":"(IF(C4=\"HS75\",VLOOKUP(\"HS75\",Tables!C15:R18,2,FALSE),IF(C4=\"HS180\",VLOOKUP(\"HS180\",Tables!C15:R18,2,FALSE),IF(C4=\"HS31\",VLOOKUP(\"HS31\",Tables!C15:R18,2,FALSE),VLOOKUP(\"HS290\",Tables!C15:R18,2,FALSE)))))","v":16},null,{"$f":"IF(Draft!$S$3=2,'LB Calcs'!G27,G27/$Q$8)","v":16},{"$f":"ROUND(I27,0)&\" \"&$Q$12","v":"16 in"}]
[null,null,null,null,null,"Embedment Height",{"$f":"(IF(C4=\"HS75\",VLOOKUP(\"HS75\",Tables!C15:R18,10,FALSE),IF(C4=\"HS180\",VLOOKUP(\"HS180\",Tables!C15:R18,10,FALSE),IF(C4=\"HS31\",VLOOKUP(\"HS31\",Tables!C15:R18,10,FALSE),VLOOKUP(\"HS290\",Tables!C15:R18,10,FALSE)))))+D12","v":6},null,{"$f":"IF(Draft!$S$3=2,'LB Calcs'!G28,G28/$Q$8)","v":6},{"$f":"ROUND(I28,0)&\" \"&$Q$12","v":"6 in"}]
[null,null,null,null,null,"Initial Backfill height",{"$f":"MAX(0,(IF(C4=\"HS75\",VLOOKUP(\"HS75\",Tables!C15:R18,11,FALSE),IF(C4=\"HS180\",VLOOKUP(\"HS180\",Tables!C15:R18,11,FALSE),IF(C4=\"HS31\",VLOOKUP(\"HS31\",Tables!C15:R18,11,FALSE),VLOOKUP(\"HS290\",Tables!C15:R18,11,FALSE))))-G28))","v":10},"ft",{"$f":"IF(Draft!$S$3=2,'LB Calcs'!G29,G29/$Q$8)","v":10},{"$f":"ROUND(I29,0)&\" \"&$Q$12","v":"10 in"}]
[null,null,null,null,null,"Min cover height above chamber",{"$f":"(IF(C4=\"HS75\",VLOOKUP(\"HS75\",Tables!C15:R18,11,FALSE),IF(C4=\"HS180\",VLOOKUP(\"HS180\",Tables!C15:R18,11,FALSE),IF(C4=\"HS31\",VLOOKUP(\"HS31\",Tables!C15:R18,11,FALSE),VLOOKUP(\"HS290\",Tables!C15:R18,11,FALSE)))))","v":16},null,{"$f":"IF(Draft!$S$3=2,'LB Calcs'!G30,G30/$Q$8)","v":16},{"$f":"ROUND(I30,0)&\" \"&$Q$12","v":"16 in"}]
{"$rows_left_out":36}
{"sheet":"Draft","index":3,"n_rows":24,"n_cols":19,"rows_kept":24,"cut":false,"hidden":true,"merged":[]}
[]
[]
["Chamber Size",null,null,null,null,null,null,"Number of Chambers",null,null,null,null,null,null,null,null,"Metric",null,2]
["Required Storage Volume",null,null,null,null,null,null,"Number of End Caps",null,null,null,null,null,null,null,null,"Standard",null,1]
["Bed size controlled by Length or Width?",null,null,null,null,null,null,"Bed Size (Including Perimiter Stone) "]
["Limiting Width or Length dimension",null,null,null,null,null,null,"Stone Required (Including Perimeter Stone)"]
["Stone Porosity",null,null,null,null,null,null,"Volume of Excavation"]
["Stone Above Chambers",null,null,null,null,null,null,"Non-Woven Filter Fabric Required (20% Safety Factor)"]
["Stone Foundation Depth",null,null,null,null,null,null,"Length of Isolator Row"]
["Average Cover Over Chambers",null,null,null,null,null,null,"Woven Isolator Row Fabric (20% Safety Factor)",null,null,null,null,null,null,null,null,null,"m2"]
[]
[]
[null,null,null,null,null,null,null,"Installed Storage Volume"]
[null,null,null,null,null,null,null,"Storage Volume per Chamber"]
[null,null,null,null,null,null,null,"Storage Volume per End Cap "]
[]
[]
["Maximum Length"]
[]
[null,"Rows of",null,"Chambers"]
[null,"Row of",null,"Chambers"]
[]
["Maximum Length"]
["Maximum Width"]

{"sheet":"Tables","index":4,"n_rows":27,"n_cols":25,"rows_kept":27,"cut":false,"hidden":true,"merged":[[0,19,0,22]]}
[null,null,"WC",null,null,null,null,null,null,null,null,null,null,null,null,null,null,null,null,"Values below based on Pipe Gallery 4.9 (2025)"]
[null,null,"System Size","ID (IN)","OD (IN)","Manifold C/C Spacing (IN)","Column Width (FT)","Edge Dist. (FT)","Bedding (in)","ID Storage Capacity (CF/FT)","Tee Width (IN)","ID Volume of Tee (CF)","OD Volume Displacement of Tee (CF)","90 Stub \n(Center to End)\n(IN)","ID Volume of 90 Elbow (CF)","Tee System Length (in)","Displacement \nSQFT","Tee Stub Length (IN)","OD Volume Displacement (CF/FT)","HS31 Endcap Stub Length (in)","HS75 Endcap Stub Length (in)","HS180 Endcap Stub Length (in)","HS290 Endcap Stub Length (in)"]
[null,1,12,12.076499999999999,14.616000000000001,23.5,0.75391666666666668,0.66666666666666663,4,0.79476437395892852,23.52,{"$f":"J3*((R3+K3)/12)","v":1.8584240277739612},{"$f":"(((E3^2)*PI()/4)/144)*((K3+R3)/12)","v":2.7245255100221986},11.76,{"$f":"J3*(N3/12)","v":0.77886908647974995},18.989999999999998,{"$f":"((E3^2)*PI()/4)/144","v":1.1651570249560363},{"$f":"4.54","v":4.54},1.0796201537103782,7.46,9.2799999999999994,10.119999999999999,11.62,null,{"$f":"T3+R3+E3","v":26.616}]
[null,2,15,15.15,17.79,28.7,0.92083333333333339,0.66666666666666663,4,1.2497635473103432,28.71,{"$f":"J4*((R4+K4)/12)","v":3.5670334579482712},{"$f":"(((E4^2)*PI()/4)/144)*((K4+R4)/12)","v":4.9267283320566726},14.36,{"$f":"J4*(N4/12)","v":1.4955503782813773},23.17,{"$f":"((E4^2)*PI()/4)/144","v":1.7261529922534329},{"$f":"5.54","v":5.54},1.6073477140742691,0,9.2799999999999994,10.119999999999999,11.62]
[null,3,18,18.084499999999998,21.363500000000002,35.4,1.1616666666666664,0.75,4,1.7828105086178345,35.35,6.2873783937255636,8.7788294578603914,17.7,{"$f":"J5*(N5/12)","v":2.6296455002113057},28.38,2.4892711128148557,{"$f":"6.97","v":6.97},2.3472077548213734,0,9.2799999999999994,10.119999999999999,11.62]
[null,4,24,24.36,28.145,47.1,1.5795833333333336,0.83333333333333337,4,3.2267200013705724,47.14,15.235496273138052,20.399767579017659,23.6,6.3458826693621262,37.619999999999997,4.3204590707414736,{"$f":"9.52","v":9.52},4.0879963224928302,0,9.2799999999999994,10.119999999999999,11.62]
[null,5,30,29.872,34.674999999999997,55,1.6937500000000003,1.5,4,4.8668701106731476,54.99,26.435216151139652,35.619960936108811,27.5,11.153244003625963,44.81,6.5578326362888255,{"$f":"10.19","v":10.19},6.2147495195340881,0,null,10.119999999999999]
[null,6,36,35.46,40.5,61.3,1.7229166666666664,1.5,4,6.8409813640721708,61.31,40.817855472297282,53.378849864529386,30.7,17.50151065641797,13.5,8.9461759549490605,{"$f":"10.29","v":10.29},8.5318927428027216,0]
[null,7,0,0,0,0,0,0,0,{"$f":"(((D9/2)^2)*PI())/144","v":0},0,0,0,0,0,0,0,0,{"$f":"((E9^2)*PI()/4)/144","v":0},0]
[null,8,8,8.1199999999999992,9.6199999999999992,null,null,null,4,0.35961636572717154,19.600000000000001,{"$f":"J10*((R10+K10)/12)","v":0.73691386943592907},1.0343197465757843,9.8000000000000007,0.29368669867719011,14.61,0.50475140133832497,4.99,0.50475140133832497,7.01]
[null,9,10,10.15,11.86,94.2,2.28125,1.5,4,0.56190057144870575,26.13,1.5578693343415364,2.127004076010063,13.07,0.61200337240288194,18.989999999999998,0.76717910766819242,7.14,0.76717910766819242,4.8600000000000003]
[null,10,1,2,3,4,5,6,7,8,9,10,11,12,13,14,15,16,17,18,19,20,21]
[null,11,"Chamber"]
[null,null,"Chamber Size","Chamber Height (in)","Chamber Width (in)","Chamber Length (installed) (in)","Manifold C/C Spacing (FT)","Chamber Spacing (in)","Edge Dist from edge of chamber. (in)","End Dist from edge of endcap (in)","Bedding (in)","Height of Embedment above Chamber (in)","Min. Initial Backfill Height (in)","Sediment Width (ft)","Storage Capacity (CF/Chamber)","Length of End Cap (in)","End Cap Storage (CF)","Sediment Width (ft)"]
[null,null,"HS31",16,34,85.47,39.9,3,12,12,6,6,16,{"$f":"4+(2/12)","v":4.166666666666667},15.16,6.875,0.62,4.1660000000000004]
[null,null,"HS75",30,51,84.9,{"$f":"E16+H16","v":57},6,12,12,6,6,18,5,46.64,10.44,3.42,5]
[null,1,"HS180",45.5,77.8,85.3,{"$f":"E17+H17","v":82.8},5,12,6,9,12,18,7.5,113.6,22.1,15.3,7.5]
[null,2,"HS290",60,100.5,48.3,109,8.5,12,12,9,12,24,9.75,109.6,32.4,39.6,9.75]
[null,3,1,2,3,4,5,6,7,8,9,10,11,12,13,14,15]
[null,4]
[null,null,null,"pink is update to spacing and cover for HS31 2025"]
[]
[]
[3]
["6 inches","Confirm distance between end cap & manifold on table"]
[null,"Confirm width of manifold on table"]
[null,"Confirm extra trench length after manifold"]

{"sheet":"Pics","index":5,"n_rows":1,"n_cols":10,"rows_kept":1,"cut":false,"hidden":true,"merged":[]}
[null,null,null,null,null,null,null,null,{"$f":"IF('LB Calcs'!$C$6=1,\"ONEMANIFOLD\",\"TWOMANIFOLDS\")","v":"ONEMANIFOLD"},{"$f":"IF('LB Calcs'!$C$6=1,\"ONEMANIFOLD\",\"TWOMANIFOLDS\")","v":"ONEMANIFOLD"}]

{"sheet":"Versions","index":6,"n_rows":22,"n_cols":6,"rows_kept":22,"cut":false,"hidden":true,"merged":[]}
[]
[null,null,"Version","Date","Action","Editor"]
[null,null,4.3,"2019-11-18","Endcap volumes where updated on the Tables Tab and one place in the VBA coding ","Sam Ewald"]
[null,null,4.4000000000000004,"2019-11-29","Coding on VBA changed so the Volume-Based tab didn't error-out when switching from standard to metric","Sam Ewald"]
[null,null,null,null,"Print area adjusted so only one page prints"]
[null,null,null,null,"New Logos added"]
[null,null,4.5,null,"Minor changes? (SPEL Version)","Sam Ewald"]
[null,null,4.5999999999999996,"2020-03-18","VBA Coding Module1 Changes","Sam Ewald"]
[null,null,null,null,"Case \"Metric\""]
[null,null,null,null,"From: \"syconversion = 0.1111\""]
[null,null,null,null,"  To:  \"syconversion = 0.83612\""]
[null,null,null,null,"From: \" cyconversion = 0.037037\""]
[null,null,null,null,"To: \"cyconversion = 0.76455\""]
[null,null,4.7,"2020-03-23","Corrected units workbook \"volume-based\" cell W14"]
[null,null,5.0999999999999996,"2020-09-17","Added in HS31 and HS290 with HS290 turned off until product release"]
[null,null,null,null,"Lots of changes to calcs, inputs, exports modified at this time","Sam Ewald"]
[null,null,5.2,"2020-09-21","Changed some formulas in Layout-based calculator to solve \"#REF\" issues with referencing manifold diamter","Sam Ewald "]
[null,null,5.3,"2020-10-01","Fixed print view on layout-based calculator ","Sam Ewald"]
[null,null,5.4,"2020-10-12","Fixed metric for layout-based manifold volume quantities","Sam Ewald"]
[null,null,5.8,"2021-02-08","Added HS290 functions","Sam Ewald"]
[null,null,5.9,"2021-09-30","Changed row spacing for HS180 from 8\" to 6\" and cover heights from 24\" to 18\".","Sam Ewald"]
[null,null,6.2,"2022-07-14","LB Calc: Trench length coding changed; now if there's 0 manifolds, it adds 2*end stone (usually 2'). If 1 man, 1 end stone+ 1 ft extra (2'). If 2 man, 2 ft extra.  Was adding 2' in all scenarios even though HS180 has less spacing.\nVB Calc: Changed min cover for HS180 from 24\" to 18\". Trenchlength now changed to =side1 as this is calculated using varying endcaptotrench variable instead of previous calculation adding 2' to systemlength. Accounts for HS180 difference in spacing of 6\" compared to 12\" for all other chambers. \nAlso NOTE: made calculator faster by going on Layout-Based Calculator tab>Find & Select>Selection pane. Then select all extra images hidden behind the top view image. Do this when copying or creating new versions as it seems to duplicate images each time a version is copied.","Amelie Dulas"]